[Jenkins] Ivyでコケる

■対策
ワークスペースを消して再実行

■原因
昔のゴミが残って多重定義になってコケてるぽい

■ログ
resolve:
[ivy:resolve] :: Ivy version :: http://ant.apache.org/ivy/ ::
[ivy:resolve] :: loading settings :: file = /var/{Jenkins Workspace}/{Organization Dir}/{Product Dir}/ivysettings.xml
[ivy:resolve] [[Fatal Error] ivy.xml:2:2: 文書内の、ルート要素より前にあるマークアップは、整形式でなければなりません。 in file:/var/{Jenkins Workspace}/{Organization Dir}/{Product Dir}/ivy.xml
[ivy:resolve] ]

BUILD FAILED
/var/{Jenkins Workspace}/{Organization Dir}/{Product Dir}/build.xml:5: syntax errors in ivy file: java.text.ParseException: [[Fatal Error] ivy.xml:2:2: 文書内の、ルート要素より前にあるマークアップは、整形式でなければなりません。 in file:/var/{Jenkins Workspace}/{Organization Dir}/{Product Dir}/ivy.xml
]
at org.apache.ivy.plugins.parser.AbstractModuleDescriptorParser$AbstractParser.checkErrors(AbstractModuleDescriptorParser.java:89)
at org.apache.ivy.plugins.parser.xml.XmlModuleDescriptorParser$Parser.parse(XmlModuleDescriptorParser.java:272)
at org.apache.ivy.plugins.parser.xml.XmlModuleDescriptorParser.parseDescriptor(XmlModuleDescriptorParser.java:112)
at org.apache.ivy.plugins.parser.AbstractModuleDescriptorParser.parseDescriptor(AbstractModuleDescriptorParser.java:48)
at org.apache.ivy.core.resolve.ResolveEngine.resolve(ResolveEngine.java:185)
at org.apache.ivy.Ivy.resolve(Ivy.java:502)
at org.apache.ivy.ant.IvyResolve.doExecute(IvyResolve.java:244)
at org.apache.ivy.ant.IvyTask.execute(IvyTask.java:277)
at org.apache.tools.ant.UnknownElement.execute(UnknownElement.java:291)
at sun.reflect.NativeMethodAccessorImpl.invoke0(Native Method)
at sun.reflect.NativeMethodAccessorImpl.invoke(NativeMethodAccessorImpl.java:60)
at sun.reflect.DelegatingMethodAccessorImpl.invoke(DelegatingMethodAccessorImpl.java:37)
at java.lang.reflect.Method.invoke(Method.java:611)
at org.apache.tools.ant.dispatch.DispatchUtils.execute(DispatchUtils.java:106)
at org.apache.tools.ant.Task.perform(Task.java:348)
at org.apache.tools.ant.Target.execute(Target.java:390)
at org.apache.tools.ant.Target.performTasks(Target.java:411)
at org.apache.tools.ant.Project.executeSortedTargets(Project.java:1399)
at org.apache.tools.ant.Project.executeTarget(Project.java:1368)
at org.apache.tools.ant.helper.DefaultExecutor.executeTargets(DefaultExecutor.java:41)
at org.apache.tools.ant.Project.executeTargets(Project.java:1251)
at org.apache.tools.ant.Main.runBuild(Main.java:809)
at org.apache.tools.ant.Main.startAnt(Main.java:217)
at org.apache.tools.ant.launch.Launcher.run(Launcher.java:280)
at org.apache.tools.ant.launch.Launcher.main(Launcher.java:109)

Total time: 0 seconds
Build step 'Antの呼び出し' marked build as failure
Notifying upstream projects of job completion
Finished: FAILURE

tag:
Apache Ivy

ref:
http://sey.sitemix.jp/blog/android/android%E9%96%8B%E7%99%BA%E5%85%A5%E9%96%80.html

tag : Ivy Jenkins

2013-12-01 11:40 : engineering : コメント : 0 : トラックバック : 0 :
コメントの投稿
非公開コメント

« next  ホーム  prev »

search

ad



counter


tag cloud

category cloud